Target
Cyclin-dependent kinase 5 activator 1
Ligand
BDBM50347803
Substrate
Meas. Tech.
ChEMBL_756462 (CHEMBL1804237)
IC50
1600±n/a nM
Citation
 Giraud, FAlves, GDebiton, ENauton, LThéry, VDurieu, EFerandin, YLozach, OMeijer, LAnizon, FPereira, EMoreau, P Synthesis, protein kinase inhibitory potencies, and in vitro antiproliferative activities of meridianin derivatives. J Med Chem 54:4474-89 (2011)  
Target
Name:
Cyclin-dependent kinase 5 activator 1
Synonyms:
CDK5/p35 Cyclin-dependent kinase 5 regulatory subunit 1 | Cyclin-dependent kinase 5/CDK5 activator 1
Type:
Protein Complex
Mol. Mass.:
Description:
Components:
This complex has 2 components.
Component 1
Name:
Cyclin-dependent kinase 5
Synonyms:
CDK5 CDKN5 Cyclin-dependent kinase 5 (CDK5/ p25) Cyclin-dependent-like kinase 5 PSSALRE Tau protein kinase II catalytic subunit
Type:
Enzyme Subunit
Mol. Mass.:
33308.61
Organism:
Homo sapiens (Human)
Description:
Residue:
292
  
Component 2
Name:
Cyclin-dependent kinase 5 activator 1
Synonyms:
CD5R1_HUMAN CDK5R1 Cyclin-dependent kinase 5 (CDK5/p25) NCK5A p35
Type:
Enzyme Subunit
Mol. Mass.:
34077.43
Organism:
Homo sapiens (Human)
Description:
Q15078
Residue:
307
  
Inhibitor
Name:
BDBM50347803
Synonyms:
CHEMBL1802404
Type:
Small organic molecule
Emp. Form.:
C12H8IN5O2
Mol. Mass.:
381.1287
SMILES:
Nc1ncc(I)c(n1)-c1c[nH]c2cc(ccc12)[N+]([O-])=O
: