Target
Potassium voltage-gated channel subfamily H member 2
Ligand
BDBM50347943
Substrate
Meas. Tech.
ChEMBL_755804 (CHEMBL1803471)
IC50
1500±n/a nM
Citation
 Wu, TNagle, AKuhen, KGagaring, KBorboa, RFrancek, CChen, ZPlouffe, DGoh, ALakshminarayana, SBWu, JAng, HQZeng, PKang, MLTan, WTan, MYe, NLin, XCaldwell, CEk, JSkolnik, SLiu, FWang, JChang, JLi, CHollenbeck, TTuntland, TIsbell, JFischli, CBrun, RRottmann, MDartois, VKeller, TDiagana, TWinzeler, EGlynne, RTully, DCChatterjee, AK Imidazolopiperazines: hit to lead optimization of new antimalarial agents. J Med Chem 54:5116-30 (2011)  
Target
Name:
Potassium voltage-gated channel subfamily H member 2
Synonyms:
1,3-beta-glucan synthase component GLS2 ERG Eag-related protein 1 Ether-a-go-go-related gene (HERG) Ether-a-go-go-related gene potassium channel 1 Ether-a-go-go-related gene potassium channel 1 (hERG1) Ether-a-go-go-related protein 1 H-ERG KCNH2 Potassium voltage-gated channel subfamily H member 2 (hERG) Voltage-gated potassium channel subunit Kv11.1 hERG Potassium Channel 1 | putative potassium channel subunit
Type:
Multi-pass membrane protein
Mol. Mass.:
126672.65
Organism:
Homo sapiens (Human)
Description:
Q12809
Residue:
1159
  
Inhibitor
Name:
BDBM50347943
Synonyms:
CHEMBL1800770
Type:
Small organic molecule
Emp. Form.:
C23H26FN5O
Mol. Mass.:
407.4838
SMILES:
Cc1ccc(Nc2c(nc3CN(CCn23)C(=O)C(C)(C)N)-c2ccc(F)cc2)cc1
: