Target
Free fatty acid receptor 1
Ligand
BDBM50362700
Substrate
Meas. Tech.
ChEMBL_797511 (CHEMBL1943341)
EC50
620±n/a nM
Citation
 Houze, JBZhu, LSun, YAkerman, MQiu, WZhang, AJSharma, RSchmitt, MWang, YLiu, JLiu, JMedina, JCReagan, JDLuo, JTonn, GZhang, JLu, JYChen, MLopez, ENguyen, KYang, LTang, LTian, HShuttleworth, SJLin, DC AMG 837: a potent, orally bioavailable GPR40 agonist. Bioorg Med Chem Lett 22:1267-70 (2012)  
Target
Name:
Free fatty acid receptor 1
Synonyms:
FFAR1 G-protein Coupled Receptor 40 | GPR40
Type:
G Protein-Coupled Receptor (GPCR)
Mol. Mass.:
31473.32
Organism:
Homo sapiens (Human)
Description:
O14842
Residue:
300
  
Inhibitor
Name:
BDBM50362700
Synonyms:
CHEMBL1939646
Type:
Small organic molecule
Emp. Form.:
C19H18O3
Mol. Mass.:
294.3444
SMILES:
CC#CC(CC(O)=O)c1ccc(OCc2ccccc2)cc1
: