Target
Bromodomain-containing protein 2
Ligand
BDBM50365463
Substrate
Meas. Tech.
ChEMBL_807449 (CHEMBL1958571)
IC50
32.5±n/a nM
Citation
 Sasaki, KIto, AYoshida, M Development of live-cell imaging probes for monitoring histone modifications. Bioorg Med Chem 20:1887-92 (2012)  
Target
Name:
Bromodomain-containing protein 2
Synonyms:
BRD2 Bromodomain and extra-terminal motif (BET) Bromodomain-containing protein 2 (BRD2) RING3
Type:
Protein
Mol. Mass.:
88085.95
Organism:
Homo sapiens (Human)
Description:
P25440
Residue:
801
  
Inhibitor
Name:
BDBM50365463
Synonyms:
CHEMBL1232461
Type:
Small organic molecule
Emp. Form.:
C22H22ClN5O2
Mol. Mass.:
423.895
SMILES:
CCNC(=O)C[C@@H]1N=C(c2ccc(Cl)cc2)c2cc(OC)ccc2-n2c(C)nnc12
: