Target
Bromodomain-containing protein 3
Ligand
BDBM50365264
Substrate
Meas. Tech.
ChEMBL_807443 (CHEMBL1958565)
Kd
46±n/a nM
Citation
 Sasaki, KIto, AYoshida, M Development of live-cell imaging probes for monitoring histone modifications. Bioorg Med Chem 20:1887-92 (2012)  
Target
Name:
Bromodomain-containing protein 3
Synonyms:
BRD3 Bromodomain and extra-terminal motif (BET) Bromodomain-containing protein 3 (BRD3) RING3-like protein | RING3L
Type:
Protein
Mol. Mass.:
79571.81
Organism:
Homo sapiens (Human)
Description:
Q15059
Residue:
726
  
Inhibitor
Name:
BDBM50365264
Synonyms:
CHEMBL1738926
Type:
Small organic molecule
Emp. Form.:
C25H21N5O2
Mol. Mass.:
423.4665
SMILES:
Cc1nnc2[C@H](NC(=O)OCc3ccccc3)N=C(c3ccccc3)c3ccccc3-n12
: