Target
Renin
Ligand
BDBM50281638
Substrate
Meas. Tech.
ChEBML_196257
Ki
2±n/a nM
Citation
 Sawyer, TFisher, JHester, JSmith, CTomasselli, ATarpley, WBurton, PHui, JMcQuade, TConradi, RBradford, VLiu, LKinner, JTustin, JAlexander, DHarrison, AEmmert, DStaples, DMaggiora, LZhang, YPoorman, RDunna, BRao, CScarborough, PLowther, WCraik, CDeCamp, DMoon, JHowe, WHeinrikson, R Peptidomimetic inhibitors of human immunodeficiency virus protease (HIV-PR): Design, enzyme binding and selectivity, antiviral efficacy, and cell permeability properties Bioorg Med Chem Lett 3:819-824 (1993)    Article 
Target
Name:
Renin
Synonyms:
Angiotensinogenase RENI_HUMAN
Type:
Enzyme
Mol. Mass.:
45058.99
Organism:
Homo sapiens (Human)
Description:
Residue:
406
  
Inhibitor
Name:
BDBM50281638
Synonyms:
(2S,4S,5S)-6-Cyclohexyl-4-hydroxy-5-{(S)-3-(1H-imidazol-4-yl)-2-[2-(naphthalen-1-yloxy)-acetylamino]-propionylamino}-2-isopropyl-hexanoic acid {(S)-2-methyl-1-[(pyridin-2-ylmethyl)-carbamoyl]-butyl}-amide | CHEMBL165706
Type:
Small organic molecule
Emp. Form.:
C45H61N7O6
Mol. Mass.:
796.0091
SMILES:
CCC(C)[C@H](NC(=O)[C@@H](C[C@H](O)[C@H](CC1CCCCC1)NC(=O)[C@H](Cc1cnc[nH]1)NC(=O)COc1cccc2ccccc12)C(C)C)C(=O)NCc1ccccn1
: