Target
Sphingomyelin phosphodiesterase 2
Ligand
BDBM50128901
Substrate
Meas. Tech.
ChEBML_144315
IC50
>100000±n/a nM
Citation
 Taguchi, MSugimoto, KGoda, KAkama, TYamamoto, KSuzuki, TTomishima, YNishiguchi, MArai, KTakahashi, KKobori, T Sphingomyelin analogues as inhibitors of sphingomyelinase. Bioorg Med Chem Lett 13:1963-6 (2003)  
Target
Name:
Sphingomyelin phosphodiesterase 2
Synonyms:
NSMA_RAT Smpd2
Type:
PROTEIN
Mol. Mass.:
47651.22
Organism:
Rattus norvegicus
Description:
ChEMBL_611790
Residue:
422
  
Inhibitor
Name:
BDBM50128901
Synonyms:
CHEMBL58502 | Pyridin-4-ylmethyl-carbamic acid (E)-(2S,3R)-3-hydroxy-2-octadecanoylamino-octadec-4-enyl ester
Type:
Small organic molecule
Emp. Form.:
C43H77N3O4
Mol. Mass.:
700.0892
SMILES:
CCCCCCCCCCCCCCCCCC(=O)N[C@@H](COC(=O)NCc1ccncc1)[C@H](O)\C=C\CCCCCCCCCCCCC
: