Target
Aromatase
Ligand
BDBM50008725
Substrate
Meas. Tech.
ChEMBL_50699 (CHEMBL663244)
IC50
14±n/a nM
Citation
 Browne, LJGude, CRodriguez, HSteele, REBhatnager, A Fadrozole hydrochloride: a potent, selective, nonsteroidal inhibitor of aromatase for the treatment of estrogen-dependent disease. J Med Chem 34:725-36 (1991)  
Target
Name:
Aromatase
Synonyms:
ARO1 CP19A_HUMAN CYP19 CYPXIX Cytochrome P450 19A1 Cytochrome P450-C19 (CYP19) FL cytokine receptor precursor | P-450AROM
Type:
Enzyme
Mol. Mass.:
57888.92
Organism:
Homo sapiens (Human)
Description:
P11511
Residue:
503
  
Inhibitor
Name:
BDBM50008725
Synonyms:
4-(6,7,8,9-Tetrahydro-5H-imidazo[1,5-a]azepin-5-yl)-benzonitrile | CHEMBL162834
Type:
Small organic molecule
Emp. Form.:
C15H15N3
Mol. Mass.:
237.2997
SMILES:
N#Cc1ccc(cc1)C1CCCCc2cncn12
: