Target
Endothelin receptor type B
Ligand
BDBM50051395
Substrate
Meas. Tech.
ChEMBL_63874 (CHEMBL671336)
IC50
1.9±n/a nM
Citation
 Fukami, TYamakawa, TNiiyama, KKojima, HAmano, YKanda, FOzaki, SFukuroda, TIhara, MYano, MIshikawa, K Synthesis and structure-activity relationships of 2-substituted D-tryptophan-containing peptidic endothelin receptor antagonists: importance of the C-2 substituent of the D-tryptophan residue for endothelin A and B receptor subtype selectivity. J Med Chem 39:2313-30 (1996)  
Target
Name:
Endothelin receptor type B
Synonyms:
EDNRB Endothelin receptor ET-B
Type:
PROTEIN
Mol. Mass.:
49616.89
Organism:
Sus scrofa
Description:
ChEMBL_63872
Residue:
443
  
Inhibitor
Name:
BDBM50051395
Synonyms:
2-((R)-3-(2-Bromo-1H-indol-3-yl)-2-{2-[((2S,6R)-2,6-dimethyl-piperidine-1-carbonyl)-amino]-4-methyl-pentanoylamino}-propionylamino)-3-propylsulfanyl-propionic acid | CHEMBL72891
Type:
Small organic molecule
Emp. Form.:
C31H46BrN5O5S
Mol. Mass.:
680.696
SMILES:
CCCSCC(NC(=O)[C@@H](Cc1c(Br)[nH]c2ccccc12)NC(=O)C(CC(C)C)NC(=O)N1[C@@H](C)CCC[C@H]1C)C(O)=O
: