Target
Transient receptor potential cation channel subfamily V member 1
Ligand
BDBM50366620
Substrate
Meas. Tech.
ChEMBL_215635 (CHEMBL820953)
Ki
0.120±n/a nM
Citation
 Walpole, CSBevan, SBloomfield, GBreckenridge, RJames, IFRitchie, TSzallasi, AWinter, JWrigglesworth, R Similarities and differences in the structure-activity relationships of capsaicin and resiniferatoxin analogues. J Med Chem 39:2939-52 (1996)  
Target
Name:
Transient receptor potential cation channel subfamily V member 1
Synonyms:
Capsaicin receptor TRPV1_RAT Trpv1 Vanilloid VR1 Vanilloid receptor 1 (VRI/TRPV1) Vanilloid receptor type 1-like (TrpV1/Vr1) Vr1l | osm-9-like TRP channel 1
Type:
Transient Receptor
Mol. Mass.:
94956.12
Organism:
Rattus norvegicus (rat)
Description:
O35433
Residue:
838
  
Inhibitor
Name:
BDBM50366620
Synonyms:
RESINIFERATOXIN
Type:
Small organic molecule
Emp. Form.:
C37H40O9
Mol. Mass.:
628.7081
SMILES:
COc1cc(CC(=O)OCC2=C[C@H]3[C@H]4OC5(Cc6ccccc6)O[C@@]4(C[C@@H](C)[C@]3(O5)[C@@H]3C=C(C)C(=O)[C@@]3(O)C2)C(C)=C)ccc1O
: