Target
Tetanus toxin
Ligand
BDBM50073672
Substrate
Meas. Tech.
ChEMBL_210251 (CHEMBL809278)
Ki
250000±n/a nM
Citation
 Martin, LCornille, FTurcaud, SMeudal, HRoques, BPFournié-Zaluski, MC Metallopeptidase inhibitors of tetanus toxin: A combinatorial approach. J Med Chem 42:515-25 (1999)  
Target
Name:
Tetanus toxin
Synonyms:
TETX_CLOTE Tetanus toxin chain H Tetanus toxin heavy chain tetX
Type:
PROTEIN
Mol. Mass.:
150674.51
Organism:
Clostridium tetani
Description:
ChEMBL_210251
Residue:
1315
  
Inhibitor
Name:
BDBM50073672
Synonyms:
(R)-3-Carbamoyl-1-mercaptomethyl-propyl-ammonium
Type:
Small organic molecule
Emp. Form.:
C5H13N2OS
Mol. Mass.:
149.234
SMILES:
NC(=O)CC[C@@H]([NH3+])CS
: