Target
Tetanus toxin
Ligand
BDBM50073673
Substrate
Meas. Tech.
ChEMBL_210251 (CHEMBL809278)
Ki
80000±n/a nM
Citation
 Martin, LCornille, FTurcaud, SMeudal, HRoques, BPFournié-Zaluski, MC Metallopeptidase inhibitors of tetanus toxin: A combinatorial approach. J Med Chem 42:515-25 (1999)  
Target
Name:
Tetanus toxin
Synonyms:
TETX_CLOTE Tetanus toxin chain H Tetanus toxin heavy chain tetX
Type:
PROTEIN
Mol. Mass.:
150674.51
Organism:
Clostridium tetani
Description:
ChEMBL_210251
Residue:
1315
  
Inhibitor
Name:
BDBM50073673
Synonyms:
N-[(2SR,3S)-3-Amino-5-carbamoyl-2-sulfanylpentanoyl]-L-phenylalanyl-L-glutamyl-L-threonyl-L-serine
Type:
Small organic molecule
Emp. Form.:
C27H41N6O12S
Mol. Mass.:
673.712
SMILES:
C[C@@H](O)[C@H](NC(=O)[C@H](CCC(O)=O)NC(=O)[C@@H](Cc1ccccc1)NC(=O)C(S)[C@@H]([NH3+])CCC(=O)ON)C(=O)N[C@@H](CO)C(O)=O
: