Target
GTPase HRas
Ligand
BDBM50089967
Substrate
Meas. Tech.
ChEMBL_82664 (CHEMBL694129)
IC50
15±n/a nM
Citation
 Baraldi, PGRomagnoli, RBeria, ICozzi, PGeroni, CMongelli, NBianchi, NMischiati, CGambari, R Synthesis and antitumor activity of new benzoheterocyclic derivatives of distamycin A. J Med Chem 43:2675-84 (2000)  
Target
Name:
GTPase HRas
Synonyms:
GTPase HRas, N-terminally processed H-Ras-1 HRAS1 His6-Ha-Ras-CVLS Transforming protein p21 Wild-type Ha-Ras p21ras
Type:
Other Protein Type
Mol. Mass.:
21293.37
Organism:
Homo sapiens (Human)
Description:
P01112
Residue:
189
  
Inhibitor
Name:
BDBM50089967
Synonyms:
5-{4-[Bis-(2-chloro-ethyl)-amino]-benzoylamino}-1H-indole-2-carboxylic acid (5-{5-[5-(2-carbamimidoyl-ethylcarbamoyl)-1-methyl-1H-pyrrol-3-ylcarbamoyl]-1-methyl-1H-pyrrol-3-ylcarbamoyl}-1-methyl-1H-pyrrol-3-yl)-amide; hydrochloride | CHEMBL554353
Type:
Small organic molecule
Emp. Form.:
C41H44Cl2N12O5
Mol. Mass.:
855.771
SMILES:
Cn1cc(NC(=O)c2cc(NC(=O)c3cc(NC(=O)c4cc5cc(NC(=O)c6ccc(cc6)N(CCCl)CCCl)ccc5[nH]4)cn3C)cn2C)cc1C(=O)NCCC(N)=N
: