Target
Steroid 17-alpha-hydroxylase/17,20 lyase
Ligand
BDBM50093590
Substrate
Meas. Tech.
ChEMBL_50370 (CHEMBL661713)
IC50
300±n/a nM
Citation
 Hartmann, RWHector, MHaidar, SEhmer, PBReichert, WJose, J Synthesis and evaluation of novel steroidal oxime inhibitors of P450 17 (17 alpha-hydroxylase/C17-20-lyase) and 5 alpha-reductase types 1 and 2. J Med Chem 43:4266-77 (2000)  
Target
Name:
Steroid 17-alpha-hydroxylase/17,20 lyase
Synonyms:
CP17A_RAT Cyp17a1 Cytochrome P450 17A1 Steroid 17-alpha-hydroxylase/17,20 lyase
Type:
Enzyme
Mol. Mass.:
57255.68
Organism:
Rattus norvegicus (Rat)
Description:
P11715
Residue:
507
  
Inhibitor
Name:
BDBM50093590
Synonyms:
(10,13-Dimethyl-3-oxo-2,3,6,7,8,9,10,11,12,13,14,15,16,17-tetradecahydro-1H-cyclopenta[a]phenanthren-17-yl)-acetaldehyde oxime | CHEMBL135993
Type:
Small organic molecule
Emp. Form.:
C21H31NO2
Mol. Mass.:
329.4763
SMILES:
CC12CCC3C(CCC4=CC(=O)CCC34C)C1CCC2CCN=O
: