Target
Endothelin-converting enzyme 1
Ligand
BDBM50064096
Substrate
Meas. Tech.
ChEMBL_225950 (CHEMBL843957)
IC50
150±n/a nM
Citation
 De Lombaert, SBlanchard, LStamford, LBTan, JWallace, EMSatoh, YFitt, JHoyer, DSimonsbergen, DMoliterni, JMarcopoulos, NSavage, PChou, MTrapani, AJJeng, AY Potent and selective non-peptidic inhibitors of endothelin-converting enzyme-1 with sustained duration of action. J Med Chem 43:488-504 (2000)  
Target
Name:
Endothelin-converting enzyme 1
Synonyms:
ECE-1 ECE1_HUMAN Endothelin-converting enzyme 1 (ECE1)
Type:
Enzyme
Mol. Mass.:
87155.11
Organism:
Homo sapiens (Human)
Description:
P42892
Residue:
770
  
Inhibitor
Name:
BDBM50064096
Synonyms:
CHEMBL40028 {[4-(2-Fluoro-phenyl)-1-(1H-tetrazol-5-yl)-but-3-ynylamino]-methyl}-phosphonic acid
Type:
Small organic molecule
Emp. Form.:
C12H13FN5O3P
Mol. Mass.:
325.2355
SMILES:
OP(O)(=O)CN[C@@H](CC#Cc1ccccc1F)c1nnn[nH]1
: