Target
Endothelin-converting enzyme 1
Ligand
BDBM50084895
Substrate
Meas. Tech.
ChEMBL_225950 (CHEMBL843957)
IC50
23±n/a nM
Citation
 De Lombaert, SBlanchard, LStamford, LBTan, JWallace, EMSatoh, YFitt, JHoyer, DSimonsbergen, DMoliterni, JMarcopoulos, NSavage, PChou, MTrapani, AJJeng, AY Potent and selective non-peptidic inhibitors of endothelin-converting enzyme-1 with sustained duration of action. J Med Chem 43:488-504 (2000)  
Target
Name:
Endothelin-converting enzyme 1
Synonyms:
ECE-1 ECE1_HUMAN Endothelin-converting enzyme 1 (ECE1)
Type:
Enzyme
Mol. Mass.:
87155.11
Organism:
Homo sapiens (Human)
Description:
P42892
Residue:
770
  
Inhibitor
Name:
BDBM50084895
Synonyms:
2-[(S)-3-Dibenzofuran-3-yl-2-(phosphonomethyl-amino)-propionylamino]-3-phenyl-propionic acid CHEMBL413724
Type:
Small organic molecule
Emp. Form.:
C25H25N2O7P
Mol. Mass.:
496.449
SMILES:
OC(=O)C(Cc1ccccc1)NC(=O)[C@H](Cc1ccc2c(c1)oc1ccccc21)NCP(O)(O)=O
: