Target
Endothelin-converting enzyme 1
Ligand
BDBM50084896
Substrate
Meas. Tech.
ChEMBL_225950 (CHEMBL843957)
IC50
180±n/a nM
Citation
 De Lombaert, SBlanchard, LStamford, LBTan, JWallace, EMSatoh, YFitt, JHoyer, DSimonsbergen, DMoliterni, JMarcopoulos, NSavage, PChou, MTrapani, AJJeng, AY Potent and selective non-peptidic inhibitors of endothelin-converting enzyme-1 with sustained duration of action. J Med Chem 43:488-504 (2000)  
Target
Name:
Endothelin-converting enzyme 1
Synonyms:
ECE-1 ECE1_HUMAN Endothelin-converting enzyme 1 (ECE1)
Type:
Enzyme
Mol. Mass.:
87155.11
Organism:
Homo sapiens (Human)
Description:
P42892
Residue:
770
  
Inhibitor
Name:
BDBM50084896
Synonyms:
3-Dibenzofuran-3-yl-2-(1-phosphono-ethylamino)-propionic acid | CHEMBL342077
Type:
Small organic molecule
Emp. Form.:
C17H18NO6P
Mol. Mass.:
363.3017
SMILES:
CC(N[C@@H](Cc1ccc2c(c1)oc1ccccc21)C(O)=O)P(O)(O)=O
: