Target
Endothelin-converting enzyme 1
Ligand
BDBM50064120
Substrate
Meas. Tech.
ChEMBL_225950 (CHEMBL843957)
IC50
51±n/a nM
Citation
 De Lombaert, SBlanchard, LStamford, LBTan, JWallace, EMSatoh, YFitt, JHoyer, DSimonsbergen, DMoliterni, JMarcopoulos, NSavage, PChou, MTrapani, AJJeng, AY Potent and selective non-peptidic inhibitors of endothelin-converting enzyme-1 with sustained duration of action. J Med Chem 43:488-504 (2000)  
Target
Name:
Endothelin-converting enzyme 1
Synonyms:
ECE-1 ECE1_HUMAN Endothelin-converting enzyme 1 (ECE1)
Type:
Enzyme
Mol. Mass.:
87155.11
Organism:
Homo sapiens (Human)
Description:
P42892
Residue:
770
  
Inhibitor
Name:
BDBM50064120
Synonyms:
(S)-2-[(S)-5-(2,4-Difluoro-phenyl)-2-(phosphonomethyl-amino)-pent-4-ynoylamino]-4-methyl-pentanoic acid CHEMBL289150
Type:
Small organic molecule
Emp. Form.:
C18H23F2N2O6P
Mol. Mass.:
432.3556
SMILES:
CC(C)C[C@H](NC(=O)[C@H](CC#Cc1ccc(F)cc1F)NCP(O)(O)=O)C(O)=O
: