Target
Endothelin-converting enzyme 1
Ligand
BDBM50064106
Substrate
Meas. Tech.
ChEMBL_225950 (CHEMBL843957)
IC50
410±n/a nM
Citation
 De Lombaert, SBlanchard, LStamford, LBTan, JWallace, EMSatoh, YFitt, JHoyer, DSimonsbergen, DMoliterni, JMarcopoulos, NSavage, PChou, MTrapani, AJJeng, AY Potent and selective non-peptidic inhibitors of endothelin-converting enzyme-1 with sustained duration of action. J Med Chem 43:488-504 (2000)  
Target
Name:
Endothelin-converting enzyme 1
Synonyms:
ECE-1 ECE1_HUMAN Endothelin-converting enzyme 1 (ECE1)
Type:
Enzyme
Mol. Mass.:
87155.11
Organism:
Homo sapiens (Human)
Description:
P42892
Residue:
770
  
Inhibitor
Name:
BDBM50064106
Synonyms:
CGS-26303 {[(R)-2-Biphenyl-4-yl-1-(1H-tetrazol-5-yl)-ethylamino]-methyl}-phosphonic acid {[(S)-2-Biphenyl-4-yl-1-(2H-tetrazol-5-yl)-ethylamino]-methyl}-phosphonic acid | {[2-Biphenyl-4-yl-1-(1H-tetrazol-5-yl)-ethylamino]-methyl}-phosphonic acid(CGS 26303)
Type:
Small organic molecule
Emp. Form.:
C16H18N5O3P
Mol. Mass.:
359.3196
SMILES:
OP(O)(=O)CN[C@@H](Cc1ccc(cc1)-c1ccccc1)c1nnn[nH]1
: