Target
Neprilysin
Ligand
BDBM50084903
Substrate
Meas. Tech.
ChEMBL_140876 (CHEMBL752507)
IC50
114±n/a nM
Citation
 De Lombaert, SBlanchard, LStamford, LBTan, JWallace, EMSatoh, YFitt, JHoyer, DSimonsbergen, DMoliterni, JMarcopoulos, NSavage, PChou, MTrapani, AJJeng, AY Potent and selective non-peptidic inhibitors of endothelin-converting enzyme-1 with sustained duration of action. J Med Chem 43:488-504 (2000)  
Target
Name:
Neprilysin
Synonyms:
Mme Neprilysin Neutral endopeptidase 24.11
Type:
Protein
Mol. Mass.:
85789.59
Organism:
Rattus norvegicus (Rat)
Description:
P07861
Residue:
750
  
Inhibitor
Name:
BDBM50084903
Synonyms:
CHEMBL148056 | {[2-Dibenzofuran-3-yl-1-(1H-tetrazol-5-yl)-ethylamino]-methyl}-phosphonic acid
Type:
Small organic molecule
Emp. Form.:
C16H16N5O4P
Mol. Mass.:
373.3031
SMILES:
OP(O)(=O)CNC(Cc1ccc2c(c1)oc1ccccc21)c1nnn[nH]1
: