Target
Neprilysin
Ligand
BDBM50251742
Substrate
Meas. Tech.
ChEMBL_140876 (CHEMBL752507)
IC50
30±n/a nM
Citation
 De Lombaert, SBlanchard, LStamford, LBTan, JWallace, EMSatoh, YFitt, JHoyer, DSimonsbergen, DMoliterni, JMarcopoulos, NSavage, PChou, MTrapani, AJJeng, AY Potent and selective non-peptidic inhibitors of endothelin-converting enzyme-1 with sustained duration of action. J Med Chem 43:488-504 (2000)  
Target
Name:
Neprilysin
Synonyms:
Mme Neprilysin Neutral endopeptidase 24.11
Type:
Protein
Mol. Mass.:
85789.59
Organism:
Rattus norvegicus (Rat)
Description:
P07861
Residue:
750
  
Inhibitor
Name:
BDBM50251742
Synonyms:
(3R,4R,5R,6S)-3,4,5-trihydroxy-6-methyl-tetrahydro-2H-pyran-2-yl hydrogen (S)-1-((S)-1-(1H-indol-3-yl)-3-oxobutan-2-ylamino)-4-methyl-1-oxopentan-2-ylphosphoramidate (S)-2-{(S)-2-[Hydroxy-((2S,3R,4R,5R,6S)-3,4,5-trihydroxy-6-methyl-tetrahydro-pyran-2-yloxy)-phosphorylamino]-4-methyl-pentanoylamino}-3-(1H-indol-3-yl)-propionic acid (S)-2-{(S)-2-[Hydroxy-(3,4,5-trihydroxy-6-methyl-tetrahydro-pyran-2-yloxy)-phosphorylamino]-4-methyl-1-oxo-pentylamino}-3-(1H-indol-3-yl)-propionic acid (S)-3-(1-Hydroxy-1H-indol-3-yl)-2-{(S)-2-[hydroxy-(3,4,5-trihydroxy-6-methyl-tetrahydro-pyran-2-yloxy)-phosphorylamino]-4-methyl-pentanoylamino}-propionic acid 2-{2-[Hydroxy-(3,4,5-trihydroxy-6-methyl-tetrahydro-pyran-2-yloxy)-phosphorylamino]-4-methyl-pentanoylamino}-3-(1H-indol-3-yl)-propionic acid CHEMBL479579 Phosphoramidon phosphramidon
Type:
Small organic molecule
Emp. Form.:
C23H34N3O10P
Mol. Mass.:
543.5039
SMILES:
CC(C)C[C@H](NP(O)(=O)O[C@@H]1O[C@@H](C)[C@H](O)[C@@H](O)[C@H]1O)C(=O)N[C@@H](Cc1c[nH]c2ccccc12)C(O)=O
: