Target
Endothelin-converting enzyme 1
Ligand
BDBM50084906
Substrate
Meas. Tech.
ChEMBL_225950 (CHEMBL843957)
IC50
520±n/a nM
Citation
 De Lombaert, SBlanchard, LStamford, LBTan, JWallace, EMSatoh, YFitt, JHoyer, DSimonsbergen, DMoliterni, JMarcopoulos, NSavage, PChou, MTrapani, AJJeng, AY Potent and selective non-peptidic inhibitors of endothelin-converting enzyme-1 with sustained duration of action. J Med Chem 43:488-504 (2000)  
Target
Name:
Endothelin-converting enzyme 1
Synonyms:
ECE-1 ECE1_HUMAN Endothelin-converting enzyme 1 (ECE1)
Type:
Enzyme
Mol. Mass.:
87155.11
Organism:
Homo sapiens (Human)
Description:
P42892
Residue:
770
  
Inhibitor
Name:
BDBM50084906
Synonyms:
CHEMBL343904 | {[2-(9H-Fluoren-2-yl)-1-(1H-tetrazol-5-yl)-ethylamino]-methyl}-phosphonic acid
Type:
Small organic molecule
Emp. Form.:
C17H18N5O3P
Mol. Mass.:
371.3303
SMILES:
OP(O)(=O)CNC(Cc1ccc-2c(Cc3ccccc-23)c1)c1nnn[nH]1
: