Target
Neprilysin
Ligand
BDBM50084905
Substrate
Meas. Tech.
ChEMBL_140876 (CHEMBL752507)
IC50
210±n/a nM
Citation
 De Lombaert, SBlanchard, LStamford, LBTan, JWallace, EMSatoh, YFitt, JHoyer, DSimonsbergen, DMoliterni, JMarcopoulos, NSavage, PChou, MTrapani, AJJeng, AY Potent and selective non-peptidic inhibitors of endothelin-converting enzyme-1 with sustained duration of action. J Med Chem 43:488-504 (2000)  
Target
Name:
Neprilysin
Synonyms:
Mme Neprilysin Neutral endopeptidase 24.11
Type:
Protein
Mol. Mass.:
85789.59
Organism:
Rattus norvegicus (Rat)
Description:
P07861
Residue:
750
  
Inhibitor
Name:
BDBM50084905
Synonyms:
CHEMBL147964 | {1-[2-Dibenzofuran-3-yl-1-(1H-tetrazol-5-yl)-ethylamino]-3-naphthalen-1-yl-propyl}-phosphonic acid
Type:
Small organic molecule
Emp. Form.:
C28H26N5O4P
Mol. Mass.:
527.5109
SMILES:
OP(O)(=O)C(CCc1cccc2ccccc12)N[C@@H](Cc1ccc2c(c1)oc1ccccc21)c1nnn[nH]1
: