Target
Endothelin-converting enzyme 1
Ligand
BDBM50084909
Substrate
Meas. Tech.
ChEMBL_225950 (CHEMBL843957)
IC50
>4000±n/a nM
Citation
 De Lombaert, SBlanchard, LStamford, LBTan, JWallace, EMSatoh, YFitt, JHoyer, DSimonsbergen, DMoliterni, JMarcopoulos, NSavage, PChou, MTrapani, AJJeng, AY Potent and selective non-peptidic inhibitors of endothelin-converting enzyme-1 with sustained duration of action. J Med Chem 43:488-504 (2000)  
Target
Name:
Endothelin-converting enzyme 1
Synonyms:
ECE-1 ECE1_HUMAN Endothelin-converting enzyme 1 (ECE1)
Type:
Enzyme
Mol. Mass.:
87155.11
Organism:
Homo sapiens (Human)
Description:
P42892
Residue:
770
  
Inhibitor
Name:
BDBM50084909
Synonyms:
CHEMBL147041 | {[2-(9-Methyl-9H-carbazol-2-yl)-1-(1H-tetrazol-5-yl)-ethylamino]-methyl}-phosphonic acid
Type:
Small organic molecule
Emp. Form.:
C17H19N6O3P
Mol. Mass.:
386.3449
SMILES:
Cn1c2ccccc2c2ccc(CC(NCP(O)(O)=O)c3nnn[nH]3)cc12
: