Target
Endothelin-converting enzyme 1
Ligand
BDBM50084910
Substrate
Meas. Tech.
ChEMBL_225950 (CHEMBL843957)
IC50
29±n/a nM
Citation
 De Lombaert, SBlanchard, LStamford, LBTan, JWallace, EMSatoh, YFitt, JHoyer, DSimonsbergen, DMoliterni, JMarcopoulos, NSavage, PChou, MTrapani, AJJeng, AY Potent and selective non-peptidic inhibitors of endothelin-converting enzyme-1 with sustained duration of action. J Med Chem 43:488-504 (2000)  
Target
Name:
Endothelin-converting enzyme 1
Synonyms:
ECE-1 ECE1_HUMAN Endothelin-converting enzyme 1 (ECE1)
Type:
Enzyme
Mol. Mass.:
87155.11
Organism:
Homo sapiens (Human)
Description:
P42892
Residue:
770
  
Inhibitor
Name:
BDBM50084910
Synonyms:
3-Dibenzofuran-3-yl-2-[3-(3,4-dimethoxy-phenyl)-1-phosphono-propylamino]-propionic acid | CHEMBL357441
Type:
Small organic molecule
Emp. Form.:
C26H28NO8P
Mol. Mass.:
513.4762
SMILES:
COc1ccc(CCC(N[C@@H](Cc2ccc3c(c2)oc2ccccc32)C(O)=O)P(O)(O)=O)cc1OC
: