Target
Endothelin-converting enzyme 1
Ligand
BDBM50084911
Substrate
Meas. Tech.
ChEMBL_225950 (CHEMBL843957)
IC50
30±n/a nM
Citation
 De Lombaert, SBlanchard, LStamford, LBTan, JWallace, EMSatoh, YFitt, JHoyer, DSimonsbergen, DMoliterni, JMarcopoulos, NSavage, PChou, MTrapani, AJJeng, AY Potent and selective non-peptidic inhibitors of endothelin-converting enzyme-1 with sustained duration of action. J Med Chem 43:488-504 (2000)  
Target
Name:
Endothelin-converting enzyme 1
Synonyms:
ECE-1 ECE1_HUMAN Endothelin-converting enzyme 1 (ECE1)
Type:
Enzyme
Mol. Mass.:
87155.11
Organism:
Homo sapiens (Human)
Description:
P42892
Residue:
770
  
Inhibitor
Name:
BDBM50084911
Synonyms:
CHEMBL147163 | {[2-(9-Oxo-9H-fluoren-2-yl)-1-(1H-tetrazol-5-yl)-ethylamino]-methyl}-phosphonic acid
Type:
Small organic molecule
Emp. Form.:
C17H16N5O4P
Mol. Mass.:
385.3138
SMILES:
OP(O)(=O)CNC(Cc1ccc2-c3ccccc3C(=O)c2c1)c1nnn[nH]1
: