Target
Neprilysin
Ligand
BDBM50064110
Substrate
Meas. Tech.
ChEMBL_140876 (CHEMBL752507)
IC50
5800±n/a nM
Citation
 De Lombaert, SBlanchard, LStamford, LBTan, JWallace, EMSatoh, YFitt, JHoyer, DSimonsbergen, DMoliterni, JMarcopoulos, NSavage, PChou, MTrapani, AJJeng, AY Potent and selective non-peptidic inhibitors of endothelin-converting enzyme-1 with sustained duration of action. J Med Chem 43:488-504 (2000)  
Target
Name:
Neprilysin
Synonyms:
Mme Neprilysin Neutral endopeptidase 24.11
Type:
Protein
Mol. Mass.:
85789.59
Organism:
Rattus norvegicus (Rat)
Description:
P07861
Residue:
750
  
Inhibitor
Name:
BDBM50064110
Synonyms:
2-{2-[(S)-5-(2,4-Difluoro-phenyl)-2-(phosphonomethyl-amino)-pent-4-ynoylamino]-4-methyl-pentanoylamino}-propionic acid | CHEMBL147847
Type:
Small organic molecule
Emp. Form.:
C21H28F2N3O7P
Mol. Mass.:
503.4335
SMILES:
CC(C)C[C@H](NC(=O)[C@H](CC#Cc1ccc(F)cc1F)NCP(O)(O)=O)C(=O)N[C@@H](C)C(O)=O
: