Target
Neprilysin
Ligand
BDBM50084909
Substrate
Meas. Tech.
ChEMBL_140876 (CHEMBL752507)
IC50
140±n/a nM
Citation
 De Lombaert, SBlanchard, LStamford, LBTan, JWallace, EMSatoh, YFitt, JHoyer, DSimonsbergen, DMoliterni, JMarcopoulos, NSavage, PChou, MTrapani, AJJeng, AY Potent and selective non-peptidic inhibitors of endothelin-converting enzyme-1 with sustained duration of action. J Med Chem 43:488-504 (2000)  
Target
Name:
Neprilysin
Synonyms:
Mme Neprilysin Neutral endopeptidase 24.11
Type:
Protein
Mol. Mass.:
85789.59
Organism:
Rattus norvegicus (Rat)
Description:
P07861
Residue:
750
  
Inhibitor
Name:
BDBM50084909
Synonyms:
CHEMBL147041 | {[2-(9-Methyl-9H-carbazol-2-yl)-1-(1H-tetrazol-5-yl)-ethylamino]-methyl}-phosphonic acid
Type:
Small organic molecule
Emp. Form.:
C17H19N6O3P
Mol. Mass.:
386.3449
SMILES:
Cn1c2ccccc2c2ccc(CC(NCP(O)(O)=O)c3nnn[nH]3)cc12
: