Target
Neprilysin
Ligand
BDBM50084891
Substrate
Meas. Tech.
ChEMBL_140876 (CHEMBL752507)
IC50
48000±n/a nM
Citation
 De Lombaert, SBlanchard, LStamford, LBTan, JWallace, EMSatoh, YFitt, JHoyer, DSimonsbergen, DMoliterni, JMarcopoulos, NSavage, PChou, MTrapani, AJJeng, AY Potent and selective non-peptidic inhibitors of endothelin-converting enzyme-1 with sustained duration of action. J Med Chem 43:488-504 (2000)  
Target
Name:
Neprilysin
Synonyms:
Mme Neprilysin Neutral endopeptidase 24.11
Type:
Protein
Mol. Mass.:
85789.59
Organism:
Rattus norvegicus (Rat)
Description:
P07861
Residue:
750
  
Inhibitor
Name:
BDBM50084891
Synonyms:
3-Dibenzofuran-3-yl-2-(1-phosphono-3-quinolin-8-yl-propylamino)-propionic acid | CHEMBL359024
Type:
Small organic molecule
Emp. Form.:
C27H25N2O6P
Mol. Mass.:
504.471
SMILES:
OC(=O)[C@H](Cc1ccc2c(c1)oc1ccccc21)NC(CCc1cccc2cccnc12)P(O)(O)=O
: