Target
Endothelin-converting enzyme 1
Ligand
BDBM50084905
Substrate
Meas. Tech.
ChEMBL_225950 (CHEMBL843957)
IC50
2.60±n/a nM
Citation
 De Lombaert, SBlanchard, LStamford, LBTan, JWallace, EMSatoh, YFitt, JHoyer, DSimonsbergen, DMoliterni, JMarcopoulos, NSavage, PChou, MTrapani, AJJeng, AY Potent and selective non-peptidic inhibitors of endothelin-converting enzyme-1 with sustained duration of action. J Med Chem 43:488-504 (2000)  
Target
Name:
Endothelin-converting enzyme 1
Synonyms:
ECE-1 ECE1_HUMAN Endothelin-converting enzyme 1 (ECE1)
Type:
Enzyme
Mol. Mass.:
87155.11
Organism:
Homo sapiens (Human)
Description:
P42892
Residue:
770
  
Inhibitor
Name:
BDBM50084905
Synonyms:
CHEMBL147964 | {1-[2-Dibenzofuran-3-yl-1-(1H-tetrazol-5-yl)-ethylamino]-3-naphthalen-1-yl-propyl}-phosphonic acid
Type:
Small organic molecule
Emp. Form.:
C28H26N5O4P
Mol. Mass.:
527.5109
SMILES:
OP(O)(=O)C(CCc1cccc2ccccc12)N[C@@H](Cc1ccc2c(c1)oc1ccccc21)c1nnn[nH]1
: