Target
Neprilysin
Ligand
BDBM50084894
Substrate
Meas. Tech.
ChEMBL_140876 (CHEMBL752507)
IC50
6400±n/a nM
Citation
 De Lombaert, SBlanchard, LStamford, LBTan, JWallace, EMSatoh, YFitt, JHoyer, DSimonsbergen, DMoliterni, JMarcopoulos, NSavage, PChou, MTrapani, AJJeng, AY Potent and selective non-peptidic inhibitors of endothelin-converting enzyme-1 with sustained duration of action. J Med Chem 43:488-504 (2000)  
Target
Name:
Neprilysin
Synonyms:
Mme Neprilysin Neutral endopeptidase 24.11
Type:
Protein
Mol. Mass.:
85789.59
Organism:
Rattus norvegicus (Rat)
Description:
P07861
Residue:
750
  
Inhibitor
Name:
BDBM50084894
Synonyms:
3-Dibenzofuran-3-yl-2-[3-(2,3-dimethoxy-phenyl)-1-phosphono-propylamino]-propionic acid | CHEMBL423751
Type:
Small organic molecule
Emp. Form.:
C26H28NO8P
Mol. Mass.:
513.4762
SMILES:
COc1cccc(CCC(N[C@@H](Cc2ccc3c(c2)oc2ccccc32)C(O)=O)P(O)(O)=O)c1OC
: