Target
Neprilysin
Ligand
BDBM50084913
Substrate
Meas. Tech.
ChEMBL_140876 (CHEMBL752507)
IC50
1640±n/a nM
Citation
 De Lombaert, SBlanchard, LStamford, LBTan, JWallace, EMSatoh, YFitt, JHoyer, DSimonsbergen, DMoliterni, JMarcopoulos, NSavage, PChou, MTrapani, AJJeng, AY Potent and selective non-peptidic inhibitors of endothelin-converting enzyme-1 with sustained duration of action. J Med Chem 43:488-504 (2000)  
Target
Name:
Neprilysin
Synonyms:
Mme Neprilysin Neutral endopeptidase 24.11
Type:
Protein
Mol. Mass.:
85789.59
Organism:
Rattus norvegicus (Rat)
Description:
P07861
Residue:
750
  
Inhibitor
Name:
BDBM50084913
Synonyms:
2-[3-Dibenzofuran-3-yl-2-(phosphonomethyl-amino)-propionylamino]-propionic acid | CHEMBL359437
Type:
Small organic molecule
Emp. Form.:
C19H21N2O7P
Mol. Mass.:
420.353
SMILES:
CC(NC(=O)[C@H](Cc1ccc2c(c1)oc1ccccc21)NCP(O)(O)=O)C(O)=O
: