Target
Kappa-type opioid receptor
Ligand
BDBM50098456
Substrate
Meas. Tech.
ChEMBL_145706 (CHEMBL753914)
Ki
>7463±n/a nM
Citation
 Thomas, JBHerault, XMRothman, RBAtkinson, RNBurgess, JPMascarella, SWDersch, CMXu, HFlippen-Anderson, JLGeorge, CFCarroll, FI Factors influencing agonist potency and selectivity for the opioid delta receptor are revealed in structure-activity relationship studies of the 4-[(N-substituted-4-piperidinyl)arylamino]-N,N-diethylbenzamides. J Med Chem 44:972-87 (2001)  
Target
Name:
Kappa-type opioid receptor
Synonyms:
KOR-1 OPIATE Kappa Opioid receptor Ror-d
Type:
G Protein-Coupled Receptor (GPCR)
Mol. Mass.:
42692.90
Organism:
Rattus norvegicus (rat)
Description:
P34975
Residue:
380
  
Inhibitor
Name:
BDBM50098456
Synonyms:
4-[(1-Cyclopropylmethyl-3-methyl-piperidin-4-yl)-(3-methoxy-phenyl)-amino]-N,N-diethyl-benzamide | CHEMBL175342
Type:
Small organic molecule
Emp. Form.:
C28H39N3O2
Mol. Mass.:
449.6282
SMILES:
CCN(CC)C(=O)c1ccc(cc1)N([C@@H]1CCN(CC2CC2)C[C@H]1C)c1cccc(OC)c1
: