Target
Prothrombin
Ligand
BDBM50118718
Substrate
Meas. Tech.
ChEMBL_208329 (CHEMBL813561)
Ki
0.840±n/a nM
Citation
 Adang, AEde Man, APVogel, GMGrootenhuis, PDSmit, MJPeters, CAVisser, ARewinkel, JBvan Dinther, TLucas, HKelder, Jvan Aelst, SMeuleman, DGvan Boeckel, CA Unique overlap in the prerequisites for thrombin inhibition and oral bioavailability resulting in potent oral antithrombotics. J Med Chem 45:4419-32 (2002)  
Target
Name:
Prothrombin
Synonyms:
Activation peptide fragment 1 Coagulation factor II Prothrombin precursor Thrombin heavy chain | Thrombin light chain
Type:
Protein
Mol. Mass.:
70029.57
Organism:
Homo sapiens (Human)
Description:
P00734
Residue:
622
  
Inhibitor
Name:
BDBM50118718
Synonyms:
CHEMBL343804 | {2-[2-(5-Amino-1-phenethylaminooxalyl-pentylcarbamoyl)-pyrrolidin-1-yl]-1-cyclohexylmethyl-2-oxo-ethylamino}-acetic acid
Type:
Small organic molecule
Emp. Form.:
C31H47N5O6
Mol. Mass.:
585.7348
SMILES:
NCCCC[C@H](NC(=O)[C@@H]1CCCN1C(=O)[C@@H](CC1CCCCC1)NCC(O)=O)C(=O)C(=O)NCCc1ccccc1
: