Target
Prothrombin
Ligand
BDBM50118726
Substrate
Meas. Tech.
ChEMBL_208329 (CHEMBL813561)
Ki
>1000±n/a nM
Citation
 Adang, AEde Man, APVogel, GMGrootenhuis, PDSmit, MJPeters, CAVisser, ARewinkel, JBvan Dinther, TLucas, HKelder, Jvan Aelst, SMeuleman, DGvan Boeckel, CA Unique overlap in the prerequisites for thrombin inhibition and oral bioavailability resulting in potent oral antithrombotics. J Med Chem 45:4419-32 (2002)  
Target
Name:
Prothrombin
Synonyms:
Activation peptide fragment 1 Coagulation factor II Prothrombin precursor Thrombin heavy chain | Thrombin light chain
Type:
Protein
Mol. Mass.:
70029.57
Organism:
Homo sapiens (Human)
Description:
P00734
Residue:
622
  
Inhibitor
Name:
BDBM50118726
Synonyms:
CHEMBL334701 | N-[5-Amino-1-(thiazole-2-carbonyl)-pentyl]-2-(cyclopropyl-indan-2-yl-amino)-acetamide
Type:
Small organic molecule
Emp. Form.:
C23H30N4O2S
Mol. Mass.:
426.575
SMILES:
NCCCC[C@H](NC(=O)CN(C1CC1)C1Cc2ccccc2C1)C(=O)c1nccs1
: