Target
Prothrombin
Ligand
BDBM50118729
Substrate
Meas. Tech.
ChEMBL_208329 (CHEMBL813561)
Ki
0.33±n/a nM
Citation
 Adang, AEde Man, APVogel, GMGrootenhuis, PDSmit, MJPeters, CAVisser, ARewinkel, JBvan Dinther, TLucas, HKelder, Jvan Aelst, SMeuleman, DGvan Boeckel, CA Unique overlap in the prerequisites for thrombin inhibition and oral bioavailability resulting in potent oral antithrombotics. J Med Chem 45:4419-32 (2002)  
Target
Name:
Prothrombin
Synonyms:
Activation peptide fragment 1 Coagulation factor II Prothrombin precursor Thrombin heavy chain | Thrombin light chain
Type:
Protein
Mol. Mass.:
70029.57
Organism:
Homo sapiens (Human)
Description:
P00734
Residue:
622
  
Inhibitor
Name:
BDBM50118729
Synonyms:
7-Amino-3-({1-[2-(carboxymethyl-amino)-3-cyclohexyl-propionyl]-2,5-dihydro-1H-pyrrole-2-carbonyl}-amino)-2-oxo-heptanoic acid | CHEMBL336229
Type:
Small organic molecule
Emp. Form.:
C23H36N4O7
Mol. Mass.:
480.5545
SMILES:
NCCCC[C@H](NC(=O)[C@@H]1C=CCN1C(=O)[C@@H](CC1CCCCC1)NCC(O)=O)C(=O)C(O)=O
: