Target
Kappa-type opioid receptor
Ligand
BDBM50027064
Substrate
Meas. Tech.
ChEMBL_146382 (CHEMBL754739)
Ki
0.190000±n/a nM
Citation
 Anzini, MCanullo, LBraile, CCappelli, AGallelli, AVomero, SMenziani, MCDe Benedetti, PGRizzo, MCollina, SAzzolina, OSbacchi, MGhelardini, CGaleotti, N Synthesis, biological evaluation, and receptor docking simulations of 2-[(acylamino)ethyl]-1,4-benzodiazepines as kappa-opioid receptor agonists endowed with antinociceptive and antiamnesic activity. J Med Chem 46:3853-64 (2003)  
Target
Name:
Kappa-type opioid receptor
Synonyms:
Kappa Opioid Receptor OPRK1 Opiate Kappa 1 | mu/kappa opioid receptor
Type:
G Protein-Coupled Receptor (GPCR)
Mol. Mass.:
42744.99
Organism:
Cavia porcellus (domestic guinea pig)
Description:
P41144
Residue:
380
  
Inhibitor
Name:
BDBM50027064
Synonyms:
CHEMBL2111836
Type:
Small organic molecule
Emp. Form.:
C23H23N3OS
Mol. Mass.:
389.513
SMILES:
CN1[C@@H](CCNC(=O)c2cccs2)CN=C(c2ccccc2)c2ccccc12
: