Target
Kappa-type opioid receptor
Ligand
BDBM50049808
Substrate
Meas. Tech.
ChEMBL_145244 (CHEMBL755694)
Ki
0.550000±n/a nM
Citation
 Anzini, MCanullo, LBraile, CCappelli, AGallelli, AVomero, SMenziani, MCDe Benedetti, PGRizzo, MCollina, SAzzolina, OSbacchi, MGhelardini, CGaleotti, N Synthesis, biological evaluation, and receptor docking simulations of 2-[(acylamino)ethyl]-1,4-benzodiazepines as kappa-opioid receptor agonists endowed with antinociceptive and antiamnesic activity. J Med Chem 46:3853-64 (2003)  
Target
Name:
Kappa-type opioid receptor
Synonyms:
K-OR-1 Kappa-opioid receptor (KOR) Kappa-type opioid receptor (KOR) OPIATE Kappa OPRK1 kappa opioid receptor (KOR)
Type:
G Protein-Coupled Receptor (GPCR)
Mol. Mass.:
42648.76
Organism:
Homo sapiens (Human)
Description:
P41145
Residue:
380
  
Inhibitor
Name:
BDBM50049808
Synonyms:
CHEMBL127968 | N-[2-(7-Chloro-1-methyl-5-phenyl-2,3-dihydro-1H-benzo[e][1,4]diazepin-2-yl)-ethyl]-4-fluoro-benzamide
Type:
Small organic molecule
Emp. Form.:
C25H23ClFN3O
Mol. Mass.:
435.921
SMILES:
CN1C(CCNC(=O)c2ccc(F)cc2)CN=C(c2ccccc2)c2cc(Cl)ccc12
: