Target
Kinesin-like protein KIF11
Ligand
BDBM50187904
Substrate
Meas. Tech.
ChEMBL_386918 (CHEMBL853415)
IC50
650±n/a nM
Citation
 Kim, KSLu, SCornelius, LALombardo, LJBorzilleri, RMSchroeder, GMSheng, CRovnyak, GCrews, DSchmidt, RJWilliams, DKBhide, RSTraeger, SCMcDonnell, PAMueller, LSheriff, SNewitt, JAPudzianowski, ATYang, ZWild, RLee, FYBatorsky, RRyder, JSOrtega-Nanos, MShen, HGottardis, MRoussell, DL Synthesis and SAR of pyrrolotriazine-4-one based Eg5 inhibitors. Bioorg Med Chem Lett 16:3937-42 (2006)  
Target
Name:
Kinesin-like protein KIF11
Synonyms:
EG5 KIF11_HUMAN Kinesin Spindle Protein Eg5 TRIP5 | kinesin spindle protein
Type:
PROTEIN
Mol. Mass.:
119138.97
Organism:
Homo sapiens (Human)
Description:
ChEMBL_1457426
Residue:
1056
  
Inhibitor
Name:
BDBM50187904
Synonyms:
CHEMBL377009 | N-(3-amino-3-methylbutyl)-N-(1-(3-benzyl-4-oxo-3,4-dihydropyrrolo[1,2-f][1,2,4]triazin-2-yl)propyl)-4-chlorobenzamide
Type:
Small organic molecule
Emp. Form.:
C28H32ClN5O2
Mol. Mass.:
506.039
SMILES:
CCC(N(CCC(C)(C)N)C(=O)c1ccc(Cl)cc1)c1nn2cccc2c(=O)n1Cc1ccccc1
: