Target
Progesterone receptor
Ligand
BDBM50206109
Substrate
Meas. Tech.
ChEMBL_442524 (CHEMBL892689)
IC50
0.94±n/a nM
Citation
 Kang, FAGuan, JJain, NAllan, GLinton, OTannenbaum, PChen, XXu, JZhu, PGunnet, JDemarest, KLundeen, SSui, Z Parallel synthesis and SAR study of novel oxa-steroids as potent and selective progesterone receptor antagonists. Bioorg Med Chem Lett 17:2531-4 (2007)  
Target
Name:
Progesterone receptor
Synonyms:
NR3C3 PGR PRGR_HUMAN | progesterone
Type:
Protein
Mol. Mass.:
98979.52
Organism:
Homo sapiens (Human)
Description:
P06401
Residue:
933
  
Inhibitor
Name:
BDBM50206109
Synonyms:
(8S,11R,13S,14R,17S)-17-(4-bromo-phenylethynyl)-11-(4-dimethylamino-phenyl)-17-hydroxy-13-methyl-1,2,8,11,12,13,14,15,16,17-decahydro-6H-7-oxa-cyclopenta[a]phenanthren-3-one | CHEMBL390700
Type:
Small organic molecule
Emp. Form.:
C33H34BrNO3
Mol. Mass.:
572.532
SMILES:
CN(C)c1ccc(cc1)[C@H]1C[C@@]2(C)[C@@H](CC[C@@]2(O)C#Cc2ccc(Br)cc2)[C@@H]2OCC3=CC(=O)CCC3=C12
: