Target
Glucocorticoid receptor
Ligand
BDBM50206114
Substrate
Meas. Tech.
ChEMBL_442525 (CHEMBL892690)
IC50
43.5±n/a nM
Citation
 Kang, FAGuan, JJain, NAllan, GLinton, OTannenbaum, PChen, XXu, JZhu, PGunnet, JDemarest, KLundeen, SSui, Z Parallel synthesis and SAR study of novel oxa-steroids as potent and selective progesterone receptor antagonists. Bioorg Med Chem Lett 17:2531-4 (2007)  
Target
Name:
Glucocorticoid receptor
Synonyms:
GCR_HUMAN GRL Glucocorticoid receptor (GRFP) Nuclear receptor subfamily 3 group C member 1
Type:
Enzyme
Mol. Mass.:
85656.87
Organism:
Homo sapiens (Human)
Description:
P04150
Residue:
777
  
Inhibitor
Name:
BDBM50206114
Synonyms:
(8S,11R,13S,14R,17S)-17-(4-chloro-phenylethynyl)-11-(4-dimethylamino-phenyl)-17-hydroxy-13-methyl-1,2,8,11,12,13,14,15,16,17-decahydro-6H-7-oxa-cyclopenta[a]phenanthren-3-one | CHEMBL232428
Type:
Small organic molecule
Emp. Form.:
C33H34ClNO3
Mol. Mass.:
528.081
SMILES:
CN(C)c1ccc(cc1)[C@H]1C[C@@]2(C)[C@@H](CC[C@@]2(O)C#Cc2ccc(Cl)cc2)[C@@H]2OCC3=CC(=O)CCC3=C12
: