Target
Type-1 angiotensin II receptor A
Ligand
BDBM50049186
Substrate
Meas. Tech.
ChEMBL_478822 (CHEMBL925709)
IC50
3.4±n/a nM
Citation
 Cappelli, ANannicini, CGallelli, AGiuliani, GValenti, SMohr, GlAnzini, MMennuni, LFerrari, FCaselli, GGiordani, APeris, WMakovec, FGiorgi, GVomero, S Design, synthesis, and biological evaluation of AT1 angiotensin II receptor antagonists based on the pyrazolo[3,4-b]pyridine and related heteroaromatic bicyclic systems. J Med Chem 51:2137-46 (2008)  
Target
Name:
Type-1 angiotensin II receptor A
Synonyms:
AGTRA_RAT Agtr1 Angiotensin II AT1 Angiotensin II receptor (AT-1) type-1 Type-1A angiotensin II receptor
Type:
Enzyme Catalytic Domain
Mol. Mass.:
40910.53
Organism:
RAT
Description:
ANGIOTENSIN AT1 AGTR1 RAT::P25095
Residue:
359
  
Inhibitor
Name:
BDBM50049186
Synonyms:
(S)-3-Methyl-2-{pentanoyl-[2'-(1H-tetrazol-5-yl)-biphenyl-4-ylmethyl]-amino}-butyric acid 2-{[2'-(2,3-Dihydro-1H-tetrazol-5-yl)-biphenyl-4-ylmethyl]-pentanoyl-amino}-3-methyl-butyric acid 3-Methyl-2-{pentanoyl-[2'-(1H-tetrazol-5-yl)-biphenyl-4-yl]-amino}-butyric acid CHEMBL1069 Exforge VALSARTAN
Type:
Small organic molecule
Emp. Form.:
C24H29N5O3
Mol. Mass.:
435.5188
SMILES:
CCCCC(=O)N(Cc1ccc(cc1)-c1ccccc1-c1nnn[nH]1)[C@@H](C(C)C)C(O)=O
: