Target
Type-1 angiotensin II receptor A
Ligand
BDBM50376903
Substrate
Meas. Tech.
ChEMBL_478822 (CHEMBL925709)
IC50
114±n/a nM
Citation
 Cappelli, ANannicini, CGallelli, AGiuliani, GValenti, SMohr, GlAnzini, MMennuni, LFerrari, FCaselli, GGiordani, APeris, WMakovec, FGiorgi, GVomero, S Design, synthesis, and biological evaluation of AT1 angiotensin II receptor antagonists based on the pyrazolo[3,4-b]pyridine and related heteroaromatic bicyclic systems. J Med Chem 51:2137-46 (2008)  
Target
Name:
Type-1 angiotensin II receptor A
Synonyms:
AGTRA_RAT Agtr1 Angiotensin II AT1 Angiotensin II receptor (AT-1) type-1 Type-1A angiotensin II receptor
Type:
Enzyme Catalytic Domain
Mol. Mass.:
40910.53
Organism:
RAT
Description:
ANGIOTENSIN AT1 AGTR1 RAT::P25095
Residue:
359
  
Inhibitor
Name:
BDBM50376903
Synonyms:
CHEMBL260578
Type:
Small organic molecule
Emp. Form.:
C25H23N7O2
Mol. Mass.:
453.4958
SMILES:
CCCCn1nc(OCc2ccc(cc2)-c2ccccc2-c2nnn[nH]2)c2cccnc2c1=O
: