Target
Type-1 angiotensin II receptor A
Ligand
BDBM50376919
Substrate
Meas. Tech.
ChEMBL_478822 (CHEMBL925709)
IC50
70±n/a nM
Citation
 Cappelli, ANannicini, CGallelli, AGiuliani, GValenti, SMohr, GlAnzini, MMennuni, LFerrari, FCaselli, GGiordani, APeris, WMakovec, FGiorgi, GVomero, S Design, synthesis, and biological evaluation of AT1 angiotensin II receptor antagonists based on the pyrazolo[3,4-b]pyridine and related heteroaromatic bicyclic systems. J Med Chem 51:2137-46 (2008)  
Target
Name:
Type-1 angiotensin II receptor A
Synonyms:
AGTRA_RAT Agtr1 Angiotensin II AT1 Angiotensin II receptor (AT-1) type-1 Type-1A angiotensin II receptor
Type:
Enzyme Catalytic Domain
Mol. Mass.:
40910.53
Organism:
RAT
Description:
ANGIOTENSIN AT1 AGTR1 RAT::P25095
Residue:
359
  
Inhibitor
Name:
BDBM50376919
Synonyms:
CHEMBL408188
Type:
Small organic molecule
Emp. Form.:
C24H22FN7O
Mol. Mass.:
443.4762
SMILES:
CCCCn1n(Cc2ccc(cc2)-c2ccccc2-c2nnn[nH]2)c2ncc(F)cc2c1=O
: