Target
Neuropeptide FF receptor 2
Ligand
BDBM50336911
Substrate
Meas. Tech.
ChEMBL_718924 (CHEMBL1681418)
IC50
0.790±n/a nM
Citation
 Oishi, SMisu, RTomita, KSetsuda, SMasuda, ROhno, HNaniwa, YIeda, NInoue, NOhkura, SUenoyama, YTsukamura, HMaeda, KHirasawa, ATsujimoto, GFujii, N Activation of Neuropeptide FF Receptors by Kisspeptin Receptor Ligands. ACS Med Chem Lett 2:53-57 (2011)  
Target
Name:
Neuropeptide FF receptor 2
Synonyms:
G-protein coupled receptor 74 GPR74 NPFF2_HUMAN NPGPR Neuropeptide G-protein coupled receptor
Type:
Enzyme Catalytic Domain
Mol. Mass.:
60293.78
Organism:
Homo sapiens (Human)
Description:
NPFF2 0 HUMAN::Q9Y5X5
Residue:
522
  
Inhibitor
Name:
BDBM50336911
Synonyms:
(S)-2-((S)-2-((S)-5-amino-2-((S)-1-((S)-2-((S)-2-((S)-2-((S)-2-amino-3-hydroxypropanamido)-4-methylpentanamido)propanamido)propanoyl)pyrrolidine-2-carboxamido)-5-oxopentanamido)-5-guanidinopentanamido)-3-phenylpropanoic acid | CHEMBL1672379
Type:
Small organic molecule
Emp. Form.:
C40H64N12O11
Mol. Mass.:
889.01
SMILES:
[#6]-[#6](-[#6])-[#6]-[#6@H](-[#7]-[#6](=O)-[#6@@H](-[#7])-[#6]-[#8])-[#6](=O)-[#7]-[#6@@H](-[#6])-[#6](=O)-[#7]-[#6@@H](-[#6])-[#6](=O)-[#7]-1-[#6]-[#6]-[#6]-[#6@H]-1-[#6](=O)-[#7]-[#6@@H](-[#6]-[#6]-[#6](-[#7])=O)-[#6](=O)-[#7]-[#6@@H](-[#6]-[#6]-[#6]\[#7]=[#6](/[#7])-[#7])-[#6](=O)-[#7]-[#6@@H](-[#6]-c1ccccc1)-[#6](-[#8])=O
: