Target
5-hydroxytryptamine receptor 3A
Ligand
BDBM50379020
Substrate
Meas. Tech.
ChEMBL_809641 (CHEMBL2015860)
Ki
132±n/a nM
Citation
 Cappelli, AManini, MPaolino, MGallelli, AAnzini, MMennuni, LDel Cadia, MDe Rienzo, FMenziani, MCVomero, S Bivalent Ligands for the Serotonin 5-HT3 Receptor. ACS Med Chem Lett 2:571-576 (2011)  
Target
Name:
5-hydroxytryptamine receptor 3A
Synonyms:
5-HT3 5HT3A_RAT Htr3 Serotonin (5-HT) receptor | Zacopride site-R
Type:
Enzyme Catalytic Domain
Mol. Mass.:
55428.70
Organism:
RAT
Description:
5-HT3 HTR3A RAT::P35563
Residue:
483
  
Inhibitor
Name:
BDBM50379020
Synonyms:
CHEMBL2011598
Type:
Small organic molecule
Emp. Form.:
C27H41N5O5
Mol. Mass.:
515.6449
SMILES:
CN1CCN(CC1)c1nc2ccccc2c(C(=O)NCCOCCOCCNC(=O)OC(C)(C)C)c1C
: