Target
Transient receptor potential M8 protein
Ligand
BDBM50380714
Substrate
Meas. Tech.
ChEMBL_813323 (CHEMBL2019444)
IC50
123±n/a nM
Citation
 Matthews, JMQin, NColburn, RWDax, SLHawkins, MMcNally, JJReany, LYoungman, MABaker, JHutchinson, TLiu, YLubin, MLNeeper, MBrandt, MRStone, DJFlores, CM The design and synthesis of novel, phosphonate-containing transient receptor potential melastatin 8 (TRPM8) antagonists. Bioorg Med Chem Lett 22:2922-6 (2012)  
Target
Name:
Transient receptor potential M8 protein
Synonyms:
Cold-menthol receptor (TRPM8) Transient receptor potential M8 protein Transient receptor potential melastatin subfamily, type 8 (TRPM8)
Type:
Enzyme
Mol. Mass.:
127589.43
Organism:
Canis lupus familiaris (Dog)
Description:
Q1A7N1
Residue:
1104
  
Inhibitor
Name:
BDBM50380714
Synonyms:
CHEMBL2017672
Type:
Small organic molecule
Emp. Form.:
C25H31F2OPS
Mol. Mass.:
448.549
SMILES:
CC(C)CP(=O)(CC(C)C)C(Cc1ccc(F)c(F)c1)c1sc2ccccc2c1C
: