Target
Fatty-acid amide hydrolase 1
Ligand
BDBM50394621
Substrate
Meas. Tech.
ChEMBL_857858 (CHEMBL2169491)
IC50
120±n/a nM
Citation
 Keith, JMApodaca, RTichenor, MXiao, WJones, WPierce, JSeierstad, MPalmer, JWebb, MKarbarz, MScott, BWilson, SLuo, LWennerholm, MChang, LBrown, SRizzolio, MRynberg, RChaplan, SBreitenbucher, JG Aryl Piperazinyl Ureas as Inhibitors of Fatty Acid Amide Hydrolase (FAAH) in Rat, Dog, and Primate. ACS Med Chem Lett 3:823-827 (2012)  
Target
Name:
Fatty-acid amide hydrolase 1
Synonyms:
Anandamide amidohydrolase FAAH FAAH1_HUMAN Fatty-acid amide hydrolase (FAAH) Oleamide hydrolase 1
Type:
Protein
Mol. Mass.:
63071.19
Organism:
Homo sapiens (Human)
Description:
O00519
Residue:
579
  
Inhibitor
Name:
BDBM50394621
Synonyms:
CHEMBL2164605 | US9169224, 26
Type:
Small organic molecule
Emp. Form.:
C19H22BrN3O3
Mol. Mass.:
420.3
SMILES:
COc1cc(Br)cc(CN2CCN(CC2)C(=O)Nc2ccccc2)c1O
: