Target
Prostaglandin E2 receptor EP4 subtype
Ligand
BDBM50193918
Substrate
Meas. Tech.
ChEMBL_857866 (CHEMBL2169499)
Ki
4304±n/a nM
Citation
 Tomasch, MSchwed, JSKuczka, KMeyer Dos Santos, SHarder, SNüsing, RMPaulke, AStark, H Fluorescent Human EP3 Receptor Antagonists. ACS Med Chem Lett 3:774-779 (2012)  
Target
Name:
Prostaglandin E2 receptor EP4 subtype
Synonyms:
PE2R4_HUMAN PGE2 receptor EP4 subtype PTGER4 Prostanoid EP4 receptor
Type:
Enzyme
Mol. Mass.:
53134.53
Organism:
Homo sapiens (Human)
Description:
P35408
Residue:
488
  
Inhibitor
Name:
BDBM50193918
Synonyms:
3-(2-((E)-3-(4-(benzyloxy)-3-methoxyphenyl)prop-1-enyl)phenyl)-N-(thiophen-2-ylsulfonyl)acrylamide | CHEMBL385955
Type:
Small organic molecule
Emp. Form.:
C30H27NO5S2
Mol. Mass.:
545.669
SMILES:
COc1cc(C\C=C\c2ccccc2\C=C\C(=O)NS(=O)(=O)c2cccs2)ccc1OCc1ccccc1
: