Target
Prostaglandin E2 receptor EP1 subtype
Ligand
BDBM50193918
Substrate
Meas. Tech.
ChEMBL_857864 (CHEMBL2169497)
Ki
2443±n/a nM
Citation
 Tomasch, MSchwed, JSKuczka, KMeyer Dos Santos, SHarder, SNüsing, RMPaulke, AStark, H Fluorescent Human EP3 Receptor Antagonists. ACS Med Chem Lett 3:774-779 (2012)  
Target
Name:
Prostaglandin E2 receptor EP1 subtype
Synonyms:
PE2R1_HUMAN PTGER1 Prostaglandin E2 receptor EP1 subtype Prostanoid EP1 receptor
Type:
Enzyme
Mol. Mass.:
41834.57
Organism:
Homo sapiens (Human)
Description:
P34995
Residue:
402
  
Inhibitor
Name:
BDBM50193918
Synonyms:
3-(2-((E)-3-(4-(benzyloxy)-3-methoxyphenyl)prop-1-enyl)phenyl)-N-(thiophen-2-ylsulfonyl)acrylamide | CHEMBL385955
Type:
Small organic molecule
Emp. Form.:
C30H27NO5S2
Mol. Mass.:
545.669
SMILES:
COc1cc(C\C=C\c2ccccc2\C=C\C(=O)NS(=O)(=O)c2cccs2)ccc1OCc1ccccc1
: